Target
Substance-K receptor
Ligand
BDBM50079412
Substrate
Meas. Tech.
ChEBML_208846
IC50
18±n/a nM
Citation
 Harbeson, SLShatzer, SALe, TBBuck, SH A new class of high affinity ligands for the neurokinin A NK2 receptor: psi (CH2NR) reduced peptide bond analogues of neurokinin A4-10. J Med Chem 35:3949-55 (1992)  
Target
Name:
Substance-K receptor
Synonyms:
NK2R_MESAU Neurokinin NK2 TACR2
Type:
Enzyme Catalytic Domain
Mol. Mass.:
43436.75
Organism:
HAMSTER
Description:
P51144
Residue:
384
  
Inhibitor
Name:
BDBM50079412
Synonyms:
(NKB)Asp-Met-His-Asp-Phe-Phe-Val-Gly-Leu-Met-NH2 Asp-Met-His-Asp-Phe-Phe-Val-Gly-Leu-Met-NH2(Neurokinin B) NKB | Neurokinin B
Type:
Small organic molecule
Emp. Form.:
C55H79N13O14S2
Mol. Mass.:
1210.424
SMILES:
CSCC[C@H](NC(=O)[C@H](CC(C)C)NC(=O)CNC(=O)[C@@H](NC(=O)[C@H](Cc1ccccc1)NC(=O)[C@H](Cc1ccccc1)NC(=O)[C@H](CC(O)=O)NC(=O)[C@H](Cc1cnc[nH]1)NC(=O)[C@H](CCSC)NC(=O)[C@@H](N)CC(O)=O)C(C)C)C(N)=O
: