Target
Platelet-activating factor receptor
Ligand
BDBM50003557
Substrate
Meas. Tech.
ChEBML_154975
IC50
450±n/a nM
Citation
 Carceller, EAlmansa, CMerlos, MGiral, MBartrolí, JGarcía-Rafanell, JForn, J (Pyridylcyanomethyl)piperazines as orally active PAF antagonists. J Med Chem 35:4118-34 (1992)  
Target
Name:
Platelet-activating factor receptor
Synonyms:
PAF-R PTAFR_CAVPO Platelet-activating factor receptor
Type:
Protein
Mol. Mass.:
39005.63
Organism:
Cavia porcellus
Description:
Residue:
342
  
Inhibitor
Name:
BDBM50003557
Synonyms:
CHEMBL559013 | [4-(2-1H-Indol-3-yl-acetyl)-piperazin-1-yl]-pyridin-3-yl-acetonitrile; trihydrochloride; hydrate
Type:
Small organic molecule
Emp. Form.:
C21H21N5O
Mol. Mass.:
359.4243
SMILES:
O=C(Cc1c[nH]c2ccccc12)N1CCN(CC1)C(C#N)c1cccnc1
: