Target
Sigma non-opioid intracellular receptor 1
Ligand
BDBM50002290
Substrate
Meas. Tech.
ChEBML_201877
Ki
4±n/a nM
Citation
 Gilligan, PJCain, GAChristos, TECook, LDrummond, SJohnson, ALKergaye, AAMcElroy, JFRohrbach, KWSchmidt, WK Novel piperidine sigma receptor ligands as potential antipsychotic drugs. J Med Chem 35:4344-61 (1992)  
Target
Name:
Sigma non-opioid intracellular receptor 1
Synonyms:
Opioid receptor, sigma 1 SGMR1_MOUSE Sigma1-receptor Sigmar1
Type:
Enzyme Catalytic Domain
Mol. Mass.:
25246.51
Organism:
Mus musculus (Mouse)
Description:
O55242
Residue:
223
  
Inhibitor
Name:
BDBM50002290
Synonyms:
1-Benzyl-4-[2-(4-fluoro-phenoxy)-ethyl]-piperidine; hydrochloride;0.2hydrate | CHEMBL540585
Type:
Small organic molecule
Emp. Form.:
C20H24FNO
Mol. Mass.:
313.4091
SMILES:
Fc1ccc(OCCC2CCN(Cc3ccccc3)CC2)cc1
: