Target
Sigma non-opioid intracellular receptor 1
Ligand
BDBM50002217
Substrate
Meas. Tech.
ChEBML_201877
Ki
3±n/a nM
Citation
 Gilligan, PJCain, GAChristos, TECook, LDrummond, SJohnson, ALKergaye, AAMcElroy, JFRohrbach, KWSchmidt, WK Novel piperidine sigma receptor ligands as potential antipsychotic drugs. J Med Chem 35:4344-61 (1992)  
Target
Name:
Sigma non-opioid intracellular receptor 1
Synonyms:
Opioid receptor, sigma 1 SGMR1_MOUSE Sigma1-receptor Sigmar1
Type:
Enzyme Catalytic Domain
Mol. Mass.:
25246.51
Organism:
Mus musculus (Mouse)
Description:
O55242
Residue:
223
  
Inhibitor
Name:
BDBM50002217
Synonyms:
2-[1-(4-Fluoro-benzyl)-piperidin-4-yl]-1-(4-fluoro-phenyl)-ethanone | CHEMBL136768
Type:
Small organic molecule
Emp. Form.:
C20H21F2NO
Mol. Mass.:
329.3836
SMILES:
Fc1ccc(CN2CCC(CC(=O)c3ccc(F)cc3)CC2)cc1
: