Target
Sterol O-acyltransferase 1
Ligand
BDBM50003844
Substrate
Meas. Tech.
ChEBML_28352
IC50
740±n/a nM
Citation
 Harris, NVSmith, CAshton, MJBridge, AWBush, RCCoffee, ECDron, DIHarper, MFLythgoe, DJNewton, CG Acyl-CoA:cholesterol O-acyl transferase (ACAT) inhibitors. 1. 2-(Alkylthio)-4,5-diphenyl-1H-imidazoles as potent inhibitors of ACAT. J Med Chem 35:4384-92 (1992)  
Target
Name:
Sterol O-acyltransferase 1
Synonyms:
ACAT-1 Acat SOAT1_RAT Sterol O-acyltransferase, Soat
Type:
PROTEIN
Mol. Mass.:
64165.56
Organism:
Rattus norvegicus
Description:
ChEMBL_28796
Residue:
545
  
Inhibitor
Name:
BDBM50003844
Synonyms:
6-(4,5-Diphenyl-1H-imidazol-2-ylsulfanylmethyl)-tetrahydro-pyran-2-one | CHEMBL136745
Type:
Small organic molecule
Emp. Form.:
C21H20N2O2S
Mol. Mass.:
364.461
SMILES:
O=C1CCCC(CSc2nc(c([nH]2)-c2ccccc2)-c2ccccc2)O1
: