Target
Sigma non-opioid intracellular receptor 1
Ligand
BDBM50002337
Substrate
Meas. Tech.
ChEBML_176509
IC50
130±n/a nM
Citation
 Yevich, JPNew, JSLobeck, WGDextraze, PBernstein, ETaylor, DPYocca, FDEison, MSTemple, DL Synthesis and biological characterization of alpha-(4-fluorophenyl)-4-(5-fluoro-2-pyrimidinyl)-1-piperazinebutanol and analogues as potential atypical antipsychotic agents. J Med Chem 35:4516-25 (1993)  
Target
Name:
Sigma non-opioid intracellular receptor 1
Synonyms:
Opioid receptor SGMR1_RAT Sigma non-opioid intracellular receptor 1 Sigma-1 | Sigmar1
Type:
Enzyme Catalytic Domain
Mol. Mass.:
25266.54
Organism:
RAT
Description:
Q9R0C9
Residue:
223
  
Inhibitor
Name:
BDBM50002337
Synonyms:
1-(4-Fluoro-phenyl)-4-(4-pyrimidin-2-yl-piperazin-1-yl)-butan-1-ol | CHEMBL335348
Type:
Small organic molecule
Emp. Form.:
C18H23FN4O
Mol. Mass.:
330.3998
SMILES:
OC(CCCN1CCN(CC1)c1ncccn1)c1ccc(F)cc1
: