Target
Kappa-type opioid receptor
Ligand
BDBM21130
Substrate
Meas. Tech.
ChEBML_145347
Ki
1.1±n/a nM
Citation
 Choi, HMurray, TFDeLander, GECaldwell, VAldrich, JV N-terminal alkylated derivatives of [D-Pro10]dynorphin A-(1-11) are highly selective for kappa-opioid receptors. J Med Chem 35:4638-9 (1993)  
Target
Name:
Kappa-type opioid receptor
Synonyms:
Kappa Opioid Receptor OPRK1 Opiate Kappa 1 | mu/kappa opioid receptor
Type:
G Protein-Coupled Receptor (GPCR)
Mol. Mass.:
42744.99
Organism:
Cavia porcellus (domestic guinea pig)
Description:
P41144
Residue:
380
  
Inhibitor
Name:
BDBM21130
Synonyms:
N-methyl-2-phenyl-N-[(5R,7S,8S)-7-(pyrrolidin-1-yl)-1-oxaspiro[4.5]decan-8-yl]acetamide U-69593 [3H]U69593
Type:
radiolabeled ligand
Emp. Form.:
C22H32N2O2
Mol. Mass.:
356.5017
SMILES:
CN([C@H]1CC[C@@]2(CCCO2)C[C@@H]1N1CCCC1)C(=O)Cc1ccccc1
: