Target
Type-1 angiotensin II receptor B
Ligand
BDBM50004159
Substrate
Meas. Tech.
ChEBML_217980
Ki
1430±n/a nM
Citation
 Atwal, KSAhmed, SZBird, JEDelaney, CLDickinson, KEFerrara, FNHedberg, AMiller, AVMoreland, SO'Reilly, BC Dihydropyrimidine angiotensin II receptor antagonists. J Med Chem 35:4751-63 (1993)  
Target
Name:
Type-1 angiotensin II receptor B
Synonyms:
AGTRB_RAT Agtr1 Angiotensin II AT1B Angiotensin II type 1b (AT-1b) receptor Type-1B angiotensin II receptor
Type:
Enzyme Catalytic Domain
Mol. Mass.:
40929.44
Organism:
RAT
Description:
Angiotensin II AT1B 0 RAT::P29089
Residue:
359
  
Inhibitor
Name:
BDBM50004159
Synonyms:
CHEMBL343622 | Sodium; 4'-(2-butyl-4-chloro-5-ethoxycarbonyl-6-phenyl-6H-pyrimidin-1-ylmethyl)-biphenyl-2-carboxylate
Type:
Small organic molecule
Emp. Form.:
C31H30ClN2O4
Mol. Mass.:
530.034
SMILES:
CCCCC1=NC(Cl)=C(C(N1Cc1ccc(cc1)-c1ccccc1C([O-])=O)c1ccccc1)C(=O)OCC
: