Target
5-hydroxytryptamine receptor 2C
Ligand
BDBM50368534
Substrate
Meas. Tech.
ChEBML_1856
Ki
>10000±n/a nM
Citation
 Herndon, JLIsmaiel, AIngher, SPTeitler, MGlennon, RA Ketanserin analogues: structure-affinity relationships for 5-HT2 and 5-HT1C serotonin receptor binding. J Med Chem 35:4903-10 (1993)  
Target
Name:
5-hydroxytryptamine receptor 2C
Synonyms:
5-HT2C 5-hydroxytryptamine receptor 2C (5HT2c) 5ht1c Htr2c Serotonin receptor 2a and 2c (5HT2A and 5HT2C)
Type:
Enzyme
Mol. Mass.:
51935.10
Organism:
Rattus norvegicus (Rat)
Description:
P08909
Residue:
460
  
Inhibitor
Name:
BDBM50368534
Synonyms:
CHEMBL1203377
Type:
Small organic molecule
Emp. Form.:
C12H17FN2
Mol. Mass.:
208.2752
SMILES:
CN1CCN(Cc2ccc(F)cc2)CC1
: