Target
Adenosine receptor A1
Ligand
BDBM81925
Substrate
Meas. Tech.
ChEBML_29305
Ki
11±n/a nM
Citation
 Jacobson, KAvan Galen, PJWilliams, M Adenosine receptors: pharmacology, structure-activity relationships, and therapeutic potential. J Med Chem 35:407-22 (1992)  
Target
Name:
Adenosine receptor A1
Synonyms:
AA1R_RAT ADENOSINE A1 high Adenosine A1 receptor (A1) Adenosine receptors A1 | Adora1
Type:
Protein
Mol. Mass.:
36704.13
Organism:
Rattus norvegicus (rat)
Description:
Residue:
326
  
Inhibitor
Name:
BDBM81925
Synonyms:
8-Cyclopentyl-1,3-dimethyl-3,7-dihydro-purine-2,6-dione CAS_1917 CPT | NSC_1917
Type:
Small organic molecule
Emp. Form.:
C12H16N4O2
Mol. Mass.:
248.281
SMILES:
Cn1c2nc([nH]c2c(=O)n(C)c1=O)C1CCCC1
: