Target
D(2) dopamine receptor
Ligand
BDBM50001861
Substrate
Meas. Tech.
ChEMBL_63061 (CHEMBL673628)
Ki
1.6±n/a nM
Citation
 Scott, MKMartin, GEDiStefano, DLFedde, CLKukla, MJBarrett, DLBaldy, WJElgin, RJKesslick, JMMathiasen, JR Pyrrole mannich bases as potential antipsychotic agents. J Med Chem 35:552-8 (1992)  
Target
Name:
D(2) dopamine receptor
Synonyms:
DOPAMINE D2 DOPAMINE D2 Short Dopamine D2 receptor Drd2
Type:
G Protein-Coupled Receptor (GPCR)
Mol. Mass.:
50931.60
Organism:
Rattus norvegicus (rat)
Description:
P61169
Residue:
444
  
Inhibitor
Name:
BDBM50001861
Synonyms:
1-{5-[4-(2-Isopropoxy-phenyl)-piperazin-1-ylmethyl]-1H-pyrrol-2-ylmethyl}-piperidin-2-one | CHEMBL434512
Type:
Small organic molecule
Emp. Form.:
C24H34N4O2
Mol. Mass.:
410.5524
SMILES:
CC(C)Oc1ccccc1N1CCN(Cc2ccc(CN3CCCCC3=O)[nH]2)CC1
: