Target
D(2) dopamine receptor
Ligand
BDBM50001863
Substrate
Meas. Tech.
ChEMBL_63061 (CHEMBL673628)
Ki
3.1±n/a nM
Citation
 Scott, MKMartin, GEDiStefano, DLFedde, CLKukla, MJBarrett, DLBaldy, WJElgin, RJKesslick, JMMathiasen, JR Pyrrole mannich bases as potential antipsychotic agents. J Med Chem 35:552-8 (1992)  
Target
Name:
D(2) dopamine receptor
Synonyms:
DOPAMINE D2 DOPAMINE D2 Short Dopamine D2 receptor Drd2
Type:
G Protein-Coupled Receptor (GPCR)
Mol. Mass.:
50931.60
Organism:
Rattus norvegicus (rat)
Description:
P61169
Residue:
444
  
Inhibitor
Name:
BDBM50001863
Synonyms:
1-{5-[4-(2-Butoxy-phenyl)-piperazin-1-ylmethyl]-1-methyl-1H-pyrrol-2-ylmethyl}-azepan-2-one | CHEMBL348002
Type:
Small organic molecule
Emp. Form.:
C27H40N4O2
Mol. Mass.:
452.6321
SMILES:
CCCCOc1ccccc1N1CCN(Cc2ccc(CN3CCCCCC3=O)n2C)CC1
: