Target
Transmembrane prolyl 4-hydroxylase
Ligand
BDBM50000400
Substrate
Meas. Tech.
ChEBML_157456
IC50
3000±n/a nM
Citation
 Dowell, RIHadley, EM Novel inhibitors of prolyl 4-hydroxylase. J Med Chem 35:800-4 (1992)  
Target
Name:
Transmembrane prolyl 4-hydroxylase
Synonyms:
Hypoxia-inducible factor prolyl 4-hydroxylase Hypoxia-inducible factor prolyl hydroxylase 4 P4HTM PH4 | Transmembrane prolyl 4-hydroxylase
Type:
Enzyme
Mol. Mass.:
56654.25
Organism:
Homo sapiens (Human)
Description:
Q9NXG6
Residue:
502
  
Inhibitor
Name:
BDBM50000400
Synonyms:
5-Phenylmethanesulfonylaminocarbonyl-pyridine-2-carboxylic acid | CHEMBL355500
Type:
Small organic molecule
Emp. Form.:
C14H12N2O5S
Mol. Mass.:
320.32
SMILES:
OC(=O)c1ccc(cn1)C(=O)NS(=O)(=O)Cc1ccccc1
: