Target
5-hydroxytryptamine receptor 3A/3B
Ligand
BDBM50000489
Substrate
Meas. Tech.
ChEMBL_2987 (CHEMBL621504)
Ki
6.1±n/a nM
Citation
 Youssefyeh, RDCampbell, HFKlein, SAirey, JEDarkes, PPowers, MSchnapper, MNeuenschwander, KFitzpatrick, LRPendley, CE Development of high-affinity 5-HT3 receptor antagonists. 1. Initial structure-activity relationship of novel benzamides. J Med Chem 35:895-903 (1992)  
Target
Name:
5-hydroxytryptamine receptor 3A/3B
Synonyms:
Serotonin 3 (5-HT3) receptor | Serotonin 3a (5-HT3a)/3b (5-HT3b) receptor
Type:
Mol. Mass.:
Description:
ASSAY_ID of EBI is 2974
Components:
This complex has 2 components.
Component 1
Name:
5-hydroxytryptamine receptor 3B
Synonyms:
5HT3B_RAT Serotonin (5-HT) receptor
Type:
PROTEIN
Mol. Mass.:
50328.78
Organism:
Rattus norvegicus
Description:
EBI_11885
Residue:
437
  
Component 2
Name:
5-hydroxytryptamine receptor 3A
Synonyms:
5-HT3 5HT3A_RAT Htr3 Serotonin (5-HT) receptor | Zacopride site-R
Type:
Enzyme Catalytic Domain
Mol. Mass.:
55428.70
Organism:
RAT
Description:
5-HT3 HTR3A RAT::P35563
Residue:
483
  
Inhibitor
Name:
BDBM50000489
Synonyms:
CHEMBL353993 | N-(1-Aza-bicyclo[2.2.2]oct-3-yl)-5-chloro-3-cyclohexyl-2-methoxy-benzamide
Type:
Small organic molecule
Emp. Form.:
C21H29ClN2O2
Mol. Mass.:
376.92
SMILES:
COc1c(cc(Cl)cc1C(=O)NC1CN2CCC1CC2)C1CCCCC1
: