Target
Adenosine receptor A1
Ligand
BDBM50267577
Substrate
Meas. Tech.
ChEMBL_29289 (CHEMBL640350)
Ki
0.700000±n/a nM
Citation
 Shimada, JSuzuki, FNonaka, HIshii, A 8-Polycycloalkyl-1,3-dipropylxanthines as potent and selective antagonists for A1-adenosine receptors. J Med Chem 35:924-30 (1992)  
Target
Name:
Adenosine receptor A1
Synonyms:
A1 adenosine receptor ADENOSINE A1 ADENOSINE A1 low Adenosine A1 receptor | Adenosine Receptor A1
Type:
Enzyme Catalytic Domain
Mol. Mass.:
36501.39
Organism:
GUINEA PIG
Description:
ADENOSINE A1 ADORA1 GUINEA PIG::P47745
Residue:
326
  
Inhibitor
Name:
BDBM50267577
Synonyms:
CHEMBL489640 | N6-((+/-)-endo-norborn-2-yl)adenosine
Type:
Small organic molecule
Emp. Form.:
C17H23N5O4
Mol. Mass.:
361.3956
SMILES:
OC[C@H]1O[C@H]([C@H](O)[C@@H]1O)n1cnc2c(NC3CC4CCC3C4)ncnc12
: