Target
Beta-2 adrenergic receptor
Ligand
BDBM50000501
Substrate
Meas. Tech.
ChEBML_37817
Ki
>100000±n/a nM
Citation
 Macchia, BBalsamo, ABreschi, MCLapucci, ALucacchini, AMacchia, FManera, CMartinelli, AMartini, CMartinotti, E Conformational effects on the activity of drugs. 13. A revision of previously proposed models for the activation of alpha- and beta-adrenergic receptors. J Med Chem 35:1009-18 (1992)  
Target
Name:
Beta-2 adrenergic receptor
Synonyms:
ADRB2 Beta-2 adrenergic receptor Beta-2 adrenoreceptor | adrenergic Beta
Type:
Enzyme Catalytic Domain
Mol. Mass.:
47141.18
Organism:
BOVINE
Description:
adrenergic Beta ADRB2 BOVINE::Q28044
Residue:
418
  
Inhibitor
Name:
BDBM50000501
Synonyms:
2-Isopropylamino-1,2,3,4-tetrahydro-naphthalene-1,6,7-triol | CHEMBL6898
Type:
Small organic molecule
Emp. Form.:
C13H19NO3
Mol. Mass.:
237.2949
SMILES:
CC(C)NC1CCc2cc(O)c(O)cc2[C@H]1O
: