Target
Acetylcholinesterase
Ligand
BDBM50005501
Substrate
Meas. Tech.
ChEBML_28737
IC50
330±n/a nM
Citation
 Sowell, JWTang, YValli, MJChapman, JMUsher, LAVaughan, CMKosh, JW Synthesis and cholinergic properties of bis[[(dimethylamino)methyl]furanyl] analogues of ranitidine. J Med Chem 35:1102-8 (1992)  
Target
Name:
Acetylcholinesterase
Synonyms:
ACES_HUMAN Acetylcholinesterase (AChE) | Acetylcholinesterase (human AChE)
Type:
Enzyme
Mol. Mass.:
67792.70
Organism:
Homo sapiens (Human)
Description:
P22303
Residue:
614
  
Inhibitor
Name:
BDBM50005501
Synonyms:
CHEMBL275537 | {5-[3-(5-Dimethylaminomethyl-furan-2-ylmethylsulfanyl)-propylsulfanylmethyl]-furan-2-ylmethyl}-dimethyl-amine
Type:
Small organic molecule
Emp. Form.:
C19H30N2O2S2
Mol. Mass.:
382.584
SMILES:
CN(C)Cc1ccc(CSCCCSCc2ccc(CN(C)C)o2)o1
: