Target
Acetylcholinesterase
Ligand
BDBM50005504
Substrate
Meas. Tech.
ChEMBL_28634 (CHEMBL644790)
IC50
74±n/a nM
Citation
 Sowell, JWTang, YValli, MJChapman, JMUsher, LAVaughan, CMKosh, JW Synthesis and cholinergic properties of bis[[(dimethylamino)methyl]furanyl] analogues of ranitidine. J Med Chem 35:1102-8 (1992)  
Target
Name:
Acetylcholinesterase
Synonyms:
ACES_HUMAN Acetylcholinesterase (AChE) | Acetylcholinesterase (human AChE)
Type:
Enzyme
Mol. Mass.:
67792.70
Organism:
Homo sapiens (Human)
Description:
P22303
Residue:
614
  
Inhibitor
Name:
BDBM50005504
Synonyms:
CHEMBL13206 | N-((5-Ethylsulfanylmethyl-furan-2-ylmethyl)-dimethyl-amine)l-N-[1-(((5-Ethylsulfanylmethyl-furan-2-ylmethyl)-dimethyl-amine)amino)-2-nitrovinyl]amine
Type:
Small organic molecule
Emp. Form.:
C22H35N5O4S2
Mol. Mass.:
497.674
SMILES:
CN(C)Cc1ccc(CSCCNCC(=NCCSCc2ccc(CN(C)C)o2)[N+]([O-])=O)o1
: