Target
Purine nucleoside phosphorylase
Ligand
BDBM50005793
Substrate
Meas. Tech.
ChEBML_162178
IC50
4600±n/a nM
Citation
 Woo, PWKostlan, CRSircar, JCDong, MKGilbertsen, RB Inhibitors of human purine nucleoside phosphorylase. Synthesis and biological activities of 8-amino-3-benzylhypoxanthine and related analogues. J Med Chem 35:1451-7 (1992)  
Target
Name:
Purine nucleoside phosphorylase
Synonyms:
Inosine phosphorylase NP PNPH_HUMAN | Purine nucleoside phosphorylase (PNPase)
Type:
Enzyme
Mol. Mass.:
32119.53
Organism:
Homo sapiens (Human)
Description:
Residue:
289
  
Inhibitor
Name:
BDBM50005793
Synonyms:
2,8-Diamino-3-thiophen-2-ylmethyl-1,9-dihydro-purin-6-one | CHEMBL284608
Type:
Small organic molecule
Emp. Form.:
C10H10N6OS
Mol. Mass.:
262.291
SMILES:
Nc1nc2c(O)nc(N)n(Cc3cccs3)c2n1
: