Target
Gastrin/cholecystokinin type B receptor
Ligand
BDBM50005810
Substrate
Meas. Tech.
ChEBML_48256
IC50
125±n/a nM
Citation
 Fincham, CIHigginbottom, MHill, DRHorwell, DCO'Toole, JCRatcliffe, GSRees, DCRoberts, E Amide bond replacements incorporated into CCK-B selective"dipeptoids". J Med Chem 35:1472-84 (1992)  
Target
Name:
Gastrin/cholecystokinin type B receptor
Synonyms:
Cckbr Cholecystokinin receptor Gastrin/cholecystokinin type B receptor
Type:
Enzyme Catalytic Domain
Mol. Mass.:
49196.59
Organism:
MOUSE
Description:
Cholecystokinin A CCKBR MOUSE::P56481
Residue:
453
  
Inhibitor
Name:
BDBM50005810
Synonyms:
CHEMBL286442 | [2-(1H-Indol-3-yl)-1-(2-phenethyl-4,5-dihydro-thiazol-5-yl)-ethyl]-carbamic acid adamantan-2-yl ester
Type:
Small organic molecule
Emp. Form.:
C32H37N3O2S
Mol. Mass.:
527.72
SMILES:
O=C(NC(Cc1c[nH]c2ccccc12)C1CN=C(CCc2ccccc2)S1)OC1[C@H]2C[C@@H]3C[C@@H](C[C@H]1C3)C2
: