Target
D(1A) dopamine receptor
Ligand
BDBM50005834
Substrate
Meas. Tech.
ChEBML_58795
Ki
>10000±n/a nM
Citation
 Flynn, DLZabrowski, DLBecker, DPNosal, RVillamil, CIGullikson, GWMoummi, CYang, DC SC-53116: the first selective agonist at the newly identified serotonin 5-HT4 receptor subtype. J Med Chem 35:1486-9 (1992)  
Target
Name:
D(1A) dopamine receptor
Synonyms:
DOPAMINE D1 Dopamine D1 high Dopamine receptor Dopamine1-like Drd1a
Type:
Enzyme Catalytic Domain
Mol. Mass.:
49429.75
Organism:
RAT
Description:
P18901
Residue:
446
  
Inhibitor
Name:
BDBM50005834
Synonyms:
1-Isopropyl-3-[2-(8-methyl-8-aza-bicyclo[3.2.1]oct-3-yl)-acetyl]-1,3-dihydro-benzoimidazol-2-one | CHEMBL38041
Type:
Small organic molecule
Emp. Form.:
C20H27N3O2
Mol. Mass.:
341.4473
SMILES:
CC(C)n1c2ccccc2n(C(=O)CC2CC3CCC(C2)N3C)c1=O
: