Target
Neutrophil elastase
Ligand
BDBM50005892
Substrate
Meas. Tech.
ChEBML_63648
IC50
8700±n/a nM
Citation
 Zembower, DEKam, CMPowers, JCZalkow, LH Novel anthraquinone inhibitors of human leukocyte elastase and cathepsin G. J Med Chem 35:1597-605 (1992)  
Target
Name:
Neutrophil elastase
Synonyms:
Bone marrow serine protease Coagulation factor X ELANE Elastase HLE Leukocyte elastase Medullasin Neutrophil elastase (HNE) PMN elastase Trypsin
Type:
Enzyme
Mol. Mass.:
28532.38
Organism:
Homo sapiens (Human)
Description:
P08246
Residue:
267
  
Inhibitor
Name:
BDBM50005892
Synonyms:
1-Hydroxy-8-methoxy-2-propyl-anthraquinone | CHEMBL289034
Type:
Small organic molecule
Emp. Form.:
C18H16O4
Mol. Mass.:
296.3172
SMILES:
CCCc1ccc2C(=O)c3cccc(OC)c3C(=O)c2c1O
: