Target
Neutrophil elastase
Ligand
BDBM50005902
Substrate
Meas. Tech.
ChEMBL_96627 (CHEMBL705700)
IC50
6600±n/a nM
Citation
 Zembower, DEKam, CMPowers, JCZalkow, LH Novel anthraquinone inhibitors of human leukocyte elastase and cathepsin G. J Med Chem 35:1597-605 (1992)  
Target
Name:
Neutrophil elastase
Synonyms:
Bone marrow serine protease Coagulation factor X ELANE Elastase HLE Leukocyte elastase Medullasin Neutrophil elastase (HNE) PMN elastase Trypsin
Type:
Enzyme
Mol. Mass.:
28532.38
Organism:
Homo sapiens (Human)
Description:
P08246
Residue:
267
  
Inhibitor
Name:
BDBM50005902
Synonyms:
2-Benzyl-1-hydroxy-anthraquinone | CHEMBL43177
Type:
Small organic molecule
Emp. Form.:
C21H14O3
Mol. Mass.:
314.3341
SMILES:
Oc1c(Cc2ccccc2)ccc2C(=O)c3ccccc3C(=O)c12
: