Target
Platelet-activating factor receptor
Ligand
BDBM50006026
Substrate
Meas. Tech.
ChEBML_221704
IC50
920±n/a nM
Citation
 Wissner, ACarroll, MLGreen, KEKerwar, SSPickett, WCSchaub, RETorley, LWWrenn, SKohler, CA Analogues of platelet activating factor. 6. Mono- and bis-aryl phosphate antagonists of platelet activating factor. J Med Chem 35:1650-62 (1992)  
Target
Name:
Platelet-activating factor receptor
Synonyms:
PAF-R PTAFR_CAVPO Platelet-activating factor receptor
Type:
Protein
Mol. Mass.:
39005.63
Organism:
Cavia porcellus
Description:
Residue:
342
  
Inhibitor
Name:
BDBM50006026
Synonyms:
3-{3-[Hydroxy-(2-methoxy-3-octadecylcarbamoyloxy-propoxy)-phosphoryloxy]-benzyl}-thiazol-3-ium | CHEMBL46976
Type:
Small organic molecule
Emp. Form.:
C33H55N2O7PS
Mol. Mass.:
654.838
SMILES:
(=O)OCC(COP([O-])(=O)Oc1cccc(C[n+]2ccsc2)c1)OC
: