Target
Muscarinic acetylcholine receptor M1
Ligand
BDBM50044688
Substrate
Meas. Tech.
ChEBML_139962
Ki
6400±n/a nM
Citation
 Tsukamoto, SIchihara, MWanibuchi, FUsuda, SHidaka, KHarada, MTamura, T Synthesis and structure-activity studies of a series of spirooxazolidine-2,4-diones: 4-oxa analogues of the muscarinic agonist 2-ethyl-8-methyl-2,8-diazaspiro[4.5]decane-1,3-dione. J Med Chem 36:2292-9 (1993)  
Target
Name:
Muscarinic acetylcholine receptor M1
Synonyms:
ACM1_RAT Chrm-1 cholinergic receptor, muscarinic 1
Type:
Enzyme Catalytic Domain
Mol. Mass.:
51390.46
Organism:
RAT
Description:
P08482
Residue:
460
  
Inhibitor
Name:
BDBM50044688
Synonyms:
4-(8-Methyl-2,4-dioxo-1-oxa-3,8-diaza-spiro[4.5]dec-3-yl)-butyric acid methyl ester; hydrochloride | CHEMBL554011
Type:
Small organic molecule
Emp. Form.:
C13H20N2O5
Mol. Mass.:
284.3083
SMILES:
COC(=O)CCCN1C(=O)OC2(CCN(C)CC2)C1=O
: