Target
Muscarinic acetylcholine receptor M1
Ligand
BDBM50044691
Substrate
Meas. Tech.
ChEBML_139962
Ki
>10000±n/a nM
Citation
 Tsukamoto, SIchihara, MWanibuchi, FUsuda, SHidaka, KHarada, MTamura, T Synthesis and structure-activity studies of a series of spirooxazolidine-2,4-diones: 4-oxa analogues of the muscarinic agonist 2-ethyl-8-methyl-2,8-diazaspiro[4.5]decane-1,3-dione. J Med Chem 36:2292-9 (1993)  
Target
Name:
Muscarinic acetylcholine receptor M1
Synonyms:
ACM1_RAT Chrm-1 cholinergic receptor, muscarinic 1
Type:
Enzyme Catalytic Domain
Mol. Mass.:
51390.46
Organism:
RAT
Description:
P08482
Residue:
460
  
Inhibitor
Name:
BDBM50044691
Synonyms:
8-Methyl-3-(2-morpholin-4-yl-ethyl)-1-oxa-3,8-diaza-spiro[4.5]decane-2,4-dione; hydrochloride | CHEMBL553727
Type:
Small organic molecule
Emp. Form.:
C14H23N3O4
Mol. Mass.:
297.3501
SMILES:
CN1CCC2(CC1)OC(=O)N(CCN1CCOCC1)C2=O
: