Target
Endothelin receptor type B
Ligand
BDBM50045224
Substrate
Meas. Tech.
ChEMBL_64029 (CHEMBL671548)
EC50
60±n/a nM
Citation
 Doherty, AMCody, WLDePue, PLHe, JXWaite, LALeonard, DMLeitz, NLDudley, DTRapundalo, STHingorani, GP Structure-activity relationships of C-terminal endothelin hexapeptide antagonists. J Med Chem 36:2585-94 (1993)  
Target
Name:
Endothelin receptor type B
Synonyms:
EDNRB_RAT ET-B Endothelin receptor | Endothelin receptor non-selective type
Type:
Enzyme Catalytic Domain
Mol. Mass.:
49483.43
Organism:
RAT
Description:
ENDOTHELIN B EDNRB RAT::P21451
Residue:
442
  
Inhibitor
Name:
BDBM50045224
Synonyms:
Ac-D-Dip-Leu-Phe-Ile-Ile-Trp | CHEMBL387200
Type:
Small organic molecule
Emp. Form.:
C55H69N7O8
Mol. Mass.:
956.1785
SMILES:
CC[C@H](C)[C@H](NC(=O)[C@@H](NC(=O)[C@H](Cc1ccccc1)NC(=O)[C@H](CC(C)C)NC(=O)[C@H](NC(C)=O)C(c1ccccc1)c1ccccc1)[C@@H](C)CC)C(=O)N[C@@H](Cc1c[nH]c2ccccc12)C(O)=O
: