Target
Sodium-dependent serotonin transporter
Ligand
BDBM50045827
Substrate
Meas. Tech.
ChEBML_201515
IC50
337±n/a nM
Citation
 Carroll, FIGray, JLAbraham, PKuzemko, MALewin, AHBoja, JWKuhar, MJ 3-Aryl-2-(3'-substituted-1',2',4'-oxadiazol-5'-yl)tropane analogues of cocaine: affinities at the cocaine binding site at the dopamine, serotonin, and norepinephrine transporters. J Med Chem 36:2886-90 (1993)  
Target
Name:
Sodium-dependent serotonin transporter
Synonyms:
5-HT Transporter 5HT transporter Anandamid membrane transporter, AMT Monoamine transporters; Norepinephrine & serotonin Slc6a4 Sodium-dependent serotonin transporter (SERT) | imipramine receptor
Type:
Multi-pass membrane protein
Mol. Mass.:
70168.43
Organism:
Rattus norvegicus (rat)
Description:
P31652
Residue:
630
  
Inhibitor
Name:
BDBM50045827
Synonyms:
3-(4-Chloro-phenyl)-2-[3-(4-methoxy-phenyl)-[1,2,4]oxadiazol-5-yl]-8-methyl-8-aza-bicyclo[3.2.1]octane
Type:
Small organic molecule
Emp. Form.:
C23H24ClN3O2
Mol. Mass.:
409.909
SMILES:
COc1ccc(cc1)-c1noc(n1)C1C2CCC(C[C@@H]1c1ccc(Cl)cc1)N2C
: