Target
Ribonucleoside-diphosphate reductase large subunit
Ligand
BDBM50368685
Substrate
Meas. Tech.
ChEBML_90946
IC50
>1000000±n/a nM
Citation
 Moss, NDéziel, RAdams, JAubry, NBailey, MBaillet, MBeaulieu, PDiMaio, JDuceppe, JSFerland, JM Inhibition of herpes simplex virus type 1 ribonucleotide reductase by substituted tetrapeptide derivatives. J Med Chem 36:3005-9 (1993)  
Target
Name:
Ribonucleoside-diphosphate reductase large subunit
Synonyms:
RIR1_HUMAN RRM1 Ribonucleoside-diphosphate reductase subunit M1 | Ribonucleotide reductase large subunit
Type:
PROTEIN
Mol. Mass.:
90074.67
Organism:
Homo sapiens (Human)
Description:
ChEMBL_90946
Residue:
792
  
Inhibitor
Name:
BDBM50368685
Synonyms:
CHEMBL1790786
Type:
Small organic molecule
Emp. Form.:
C30H51N5O9
Mol. Mass.:
625.754
SMILES:
CC[C@H](C)[C@H](NC(=O)C(CC)CC)C(=O)N[C@@H](CC(=O)N1CCCC1)C(=O)N[C@@H](CC(O)=O)C(=O)N[C@@H](CC(C)C)C(O)=O
: