Target
Substance-P receptor
Ligand
BDBM50000041
Substrate
Meas. Tech.
ChEBML_141769
Kd
0.320000±n/a nM
Citation
 Rosen, TSeeger, TFMcLean, SDesai, MCGuarino, KJBryce, DPratt, KHeym, JChalabi, PMWindels, JH Synthesis, in vitro binding profile, and autoradiographic analysis of [3H]-cis-3-[(2-methoxybenzyl)amino]-2-phenylpiperidine, a highly potent and selective nonpeptide substance P receptor antagonist radioligand. J Med Chem 36:3197-201 (1993)  
Target
Name:
Substance-P receptor
Synonyms:
NK1R_CAVPO Neurokinin NK1 TACR1
Type:
Enzyme Catalytic Domain
Mol. Mass.:
46261.42
Organism:
GUINEA PIG
Description:
Neurokinin NK1 TACR1 GUINEA PIG::P30547
Residue:
407
  
Inhibitor
Name:
BDBM50000041
Synonyms:
(+) (2-Methoxy-benzyl)-(2-phenyl-piperidin-3-yl)-amine (+/-)(2-Methoxy-benzyl)-(2-phenyl-piperidin-3-yl)-amine (-)-(2-Methoxy-benzyl)-(2-phenyl-piperidin-3-yl)-amine (2-Methoxy-benzyl)-((2S,3S)-2-phenyl-piperidin-3-yl)-amine (2S,3S)-3-(2-Methoxy-benzyloxy)-2-phenyl-piperidine CHEMBL2114310 CP 99994 Tritiated-(2-Methoxy-benzyl)-(2-phenyl-piperidin-3-yl)-amine
Type:
Small organic molecule
Emp. Form.:
C19H24N2O
Mol. Mass.:
296.4067
SMILES:
COc1ccccc1CN[C@H]1CCCN[C@H]1c1ccccc1
: