Target
DNA polymerase alpha catalytic subunit
Ligand
BDBM50231343
Substrate
Meas. Tech.
ChEMBL_50813 (CHEMBL658013)
EC50
<1±n/a nM
Comments
Zero 20220115
Citation
 Selwood, DLChalland, SRChampness, JNGillam, JHibberd, DKJandu, KSLowe, DPether, MSelway, JTrantor, GE Isosteres of the DNA polymerase inhibitor aphidicolin as potential antiviral agents against human herpes viruses. J Med Chem 36:3503-10 (1994)  
Target
Name:
DNA polymerase alpha catalytic subunit
Synonyms:
DNA polymerase (alpha/delta/epsilon) DPOLA_HUMAN POLA1
Type:
PROTEIN
Mol. Mass.:
165895.25
Organism:
Homo sapiens (Human)
Description:
ChEMBL_1365493
Residue:
1462
  
Inhibitor
Name:
BDBM50231343
Synonyms:
CHEMBL119038
Type:
Small organic molecule
Emp. Form.:
C19H26O4
Mol. Mass.:
318.4073
SMILES:
[H][C@@]12CCc3cc(CO)c(OC)cc3[C@@]1(C)CCC[C@@]2(C)C(O)=O
: