Target
DNA polymerase alpha catalytic subunit
Ligand
BDBM50042447
Substrate
Meas. Tech.
ChEBML_50813
EC50
7000±n/a nM
Citation
 Selwood, DLChalland, SRChampness, JNGillam, JHibberd, DKJandu, KSLowe, DPether, MSelway, JTrantor, GE Isosteres of the DNA polymerase inhibitor aphidicolin as potential antiviral agents against human herpes viruses. J Med Chem 36:3503-10 (1994)  
Target
Name:
DNA polymerase alpha catalytic subunit
Synonyms:
DNA polymerase (alpha/delta/epsilon) DPOLA_HUMAN POLA1
Type:
PROTEIN
Mol. Mass.:
165895.25
Organism:
Homo sapiens (Human)
Description:
ChEMBL_1365493
Residue:
1462
  
Inhibitor
Name:
BDBM50042447
Synonyms:
(2S,4aS)1,7-Bis-hydroxymethyl-1,4a-dimethyl-1,2,3,4,4a,9,10,10a-octahydro-phenanthrene-2,6-diol CHEMBL332188
Type:
Small organic molecule
Emp. Form.:
C18H26O4
Mol. Mass.:
306.3966
SMILES:
CC1(CO)[C@@H](O)CC[C@@]2(C)[C@H]1CCc1cc(CO)c(O)cc21
: