Target
5-hydroxytryptamine receptor 1A
Ligand
BDBM50368731
Substrate
Meas. Tech.
ChEMBL_829 (CHEMBL615829)
IC50
53±n/a nM
Citation
 Kawakubo, HTakagi, SYamaura, YKatoh, SIshimoto, YNagatani, TMochizuki, DKamata, TSasaki, Y (R)-1,2,3,4-tetrahydro[1]benzothieno[2,3-c]pyridines: novel optically active compounds with strong 5-HT1A receptor binding ability exhibiting anticonflict activity and lessening of memory impairment. J Med Chem 36:3526-32 (1994)  
Target
Name:
5-hydroxytryptamine receptor 1A
Synonyms:
5-HT-1A 5-HT1A 5-hydroxytryptamine receptor 1A (5HT1A) 5ht1a Htr1a Serotonin 1a (5-HT1a) receptor/Adrenergic receptor alpha-1 | Serotonin receptor 1A
Type:
G Protein-Coupled Receptor (GPCR)
Mol. Mass.:
46445.29
Organism:
Rattus norvegicus (rat)
Description:
Binding assays were performed using rat hippocampal membranes.
Residue:
422
  
Inhibitor
Name:
BDBM50368731
Synonyms:
CHEMBL1203185
Type:
Small organic molecule
Emp. Form.:
C20H18N2O3S
Mol. Mass.:
366.434
SMILES:
O=C(NCc1ccc2OCOc2c1)[C@H]1Cc2c(CN1)sc1ccccc21
: