Target
Muscarinic acetylcholine receptor M2
Ligand
BDBM50042467
Substrate
Meas. Tech.
ChEBML_98896
Ki
110±n/a nM
Citation
 Trybulski, EJZhang, JKramss, RHMangano, RM The synthesis and biochemical pharmacology of enantiomerically pure methylated oxotremorine derivatives. J Med Chem 36:3533-41 (1994)  
Target
Name:
Muscarinic acetylcholine receptor M2
Synonyms:
ACM2_RAT Chrm-2 | Chrm2
Type:
Enzyme Catalytic Domain
Mol. Mass.:
51555.53
Organism:
RAT
Description:
P10980
Residue:
466
  
Inhibitor
Name:
BDBM50042467
Synonyms:
3-Methyl-1-(4-pyrrolidin-1-yl-but-2-ynyl)-pyrrolidin-2-one | CHEMBL118700
Type:
Small organic molecule
Emp. Form.:
C13H20N2O
Mol. Mass.:
220.3107
SMILES:
C[C@H]1CCN(CC#CCN2CCCC2)C1=O
: