Target
Ribonucleoside-diphosphate reductase large subunit
Ligand
BDBM50368749
Substrate
Meas. Tech.
ChEMBL_195539 (CHEMBL800986)
IC50
8000±n/a nM
Citation
 Fisher, AYang, FDRubin, HCooperman, BS R2 C-terminal peptide inhibition of mammalian and yeast ribonucleotide reductase. J Med Chem 36:3859-62 (1994)  
Target
Name:
Ribonucleoside-diphosphate reductase large subunit
Synonyms:
RIR1_MOUSE Ribonucleoside-diphosphate reductase large subunit Ribonucleotide reductase large subunit | Rrm1
Type:
PROTEIN
Mol. Mass.:
90210.73
Organism:
Mus musculus
Description:
ChEMBL_195411
Residue:
792
  
Inhibitor
Name:
BDBM50368749
Synonyms:
CHEMBL1790913
Type:
Small organic molecule
Emp. Form.:
C41H55N7O14
Mol. Mass.:
869.9139
SMILES:
CC(C)C[C@H](NC(=O)[C@@H](NC(=O)[C@H](Cc1ccccc1)NC(C)=O)[C@H](C)O)C(=O)N[C@@H](CC(O)=O)C(=O)N[C@@H](C)C(=O)N[C@@H](CC(O)=O)C(=O)N[C@@H](Cc1ccccc1)C(O)=O
: