Target
Ribonucleoside-diphosphate reductase large subunit
Ligand
BDBM50368753
Substrate
Meas. Tech.
ChEMBL_195415 (CHEMBL803345)
IC50
286000±n/a nM
Citation
 Fisher, AYang, FDRubin, HCooperman, BS R2 C-terminal peptide inhibition of mammalian and yeast ribonucleotide reductase. J Med Chem 36:3859-62 (1994)  
Target
Name:
Ribonucleoside-diphosphate reductase large subunit
Synonyms:
RIR1_MOUSE Ribonucleoside-diphosphate reductase large subunit Ribonucleotide reductase large subunit | Rrm1
Type:
PROTEIN
Mol. Mass.:
90210.73
Organism:
Mus musculus
Description:
ChEMBL_195411
Residue:
792
  
Inhibitor
Name:
BDBM50368753
Synonyms:
CHEMBL1790916
Type:
Small organic molecule
Emp. Form.:
C40H55N7O12
Mol. Mass.:
825.9044
SMILES:
CC(C)C[C@H](NC(=O)[C@@H](NC(=O)[C@H](Cc1ccccc1)NC(C)=O)[C@H](C)O)C(=O)N[C@@H](C)C(=O)N[C@@H](C)C(=O)N[C@@H](CC(O)=O)C(=O)N[C@@H](Cc1ccccc1)C(O)=O
: