Target
Beta-1 adrenergic receptor
Ligand
BDBM50021546
Substrate
Meas. Tech.
ChEBML_30207
Ki
180000±n/a nM
Citation
 Chen, GTKing, MGusovsky, FCreveling, CRDaly, JWChen, BHNie, JYKirk, KL Syntheses of 2,5- and 2,6-difluoronorepinephrine, 2,5-difluoroepinephrine, and 2,6-difluorophenylephrine: effect of disubstitution with fluorine on adrenergic activity. J Med Chem 36:3947-55 (1994)  
Target
Name:
Beta-1 adrenergic receptor
Synonyms:
ADRB1R, B1AR Adrb1 Adrenergic receptor beta Beta-1 adrenoreceptor adrenergic Beta1,2
Type:
Protein
Mol. Mass.:
50486.84
Organism:
Rattus norvegicus (Rat)
Description:
P18090
Residue:
466
  
Inhibitor
Name:
BDBM50021546
Synonyms:
4-Fluoro-3-(1-hydroxy-2-methylamino-ethyl)-phenol CHEMBL61372
Type:
Small organic molecule
Emp. Form.:
C9H12FNO2
Mol. Mass.:
185.1955
SMILES:
CNCC(O)c1cc(O)ccc1F
: