Target
Endothelin-1 receptor
Ligand
BDBM50368775
Substrate
Meas. Tech.
ChEMBL_65811 (CHEMBL872385)
IC50
0.20±n/a nM
Citation
 Kikuchi, TKubo, KOhtaki, TSuzuki, NAsami, TShimamoto, NWakimasu, MFujino, M Endothelin-1 analogues substituted at both position 18 and 19: highly potent endothelin antagonists with no selectivity for either receptor subtype ETA or ETB. J Med Chem 36:4087-93 (1994)  
Target
Name:
Endothelin-1 receptor
Synonyms:
EDNRA Endothelin receptor ET-A
Type:
PROTEIN
Mol. Mass.:
48707.29
Organism:
Sus scrofa
Description:
ChEMBL_65803
Residue:
427
  
Inhibitor
Name:
BDBM50368775
Synonyms:
CHEMBL1790960
Type:
Small organic molecule
Emp. Form.:
C108H159N25O31S5
Mol. Mass.:
2463.892
SMILES:
CCC[C@H](NC(=O)[C@@H](NC(=O)[C@H](CC(C)C)NC(=O)[C@H](Cc1cnc[nH]1)NC(=O)[C@@H]1CSSC[C@@H](N)C(=O)N[C@@H](CO)C(=O)N[C@@H]2CSSC[C@@H](NC(=O)[C@H](CCC(O)=O)NC(=O)[C@@H](CCCCN)NC(=O)[C@H](CC(O)=O)NC(=O)[C@@H](CCSC)NC(=O)[C@H](CC(C)C)NC(=O)[C@@H](CO)NC(=O)[C@H](CO)NC2=O)C(=O)N[C@@H](C(C)C)C(=O)N[C@H](Cc2ccc(O)cc2)C(=O)N[C@@H](Cc2ccccc2)C(=O)N1)[C@@H](C)O)C(=O)N[C@@H]([C@@H](C)CC)C(=O)N[C@@H](Cc1c[nH]c2ccccc12)C(O)=O
: