Target
Adenosine receptor A2a
Ligand
BDBM14487
Substrate
Meas. Tech.
ChEMBL_27921 (CHEMBL642329)
EC50
40000±n/a nM
Citation
 Bussolari, JCRamesh, KStoeckler, JDChen, SFPanzica, RP Synthesis and biological evaluation of N4-substituted imidazo- and v-triazolo[4,5-d]pyridazine nucleosides. J Med Chem 36:4113-20 (1994)  
Target
Name:
Adenosine receptor A2a
Synonyms:
A2A adenosine receptor (hA2A) ADENOSINE A2 ADORA2 Adenosine A2A receptor (A2AAR)
Type:
G Protein-Coupled Receptor (GPCR)
Mol. Mass.:
44716.46
Organism:
Homo sapiens (Human)
Description:
P29274
Residue:
412
  
Inhibitor
Name:
BDBM14487
Synonyms:
(2R,3R,4S,5R)-2-(6-amino-9H-purin-9-yl)-5-(hydroxymethyl)oxolane-3,4-diol Adenosine N6-Methylado cid_191 | cid_60961
Type:
Nucleoside or nucleotide
Emp. Form.:
C10H13N5O4
Mol. Mass.:
267.2413
SMILES:
Nc1ncnc2n(cnc12)[C@@H]1O[C@H](CO)[C@@H](O)[C@H]1O
: