Target
Cathepsin B
Ligand
BDBM50046893
Substrate
Meas. Tech.
ChEMBL_47253 (CHEMBL656659)
IC50
78000±n/a nM
Citation
 McConnell, RMYork, JLFrizzell, DEzell, C Inhibition studies of some serine and thiol proteinases by new leupeptin analogues. J Med Chem 36:1084-9 (1993)  
Target
Name:
Cathepsin B
Synonyms:
BCSB CTSB Cathepsin B1
Type:
Enzyme
Mol. Mass.:
36657.87
Organism:
Bos taurus (bovine)
Description:
Bovine spleen CB was purchased from Sigma Co. (USA).
Residue:
335
  
Inhibitor
Name:
BDBM50046893
Synonyms:
2-[2-Acetylamino-3-(4-hydroxy-phenyl)-propionylamino]-4-methyl-pentanoic acid (1-formyl-4-guanidino-butyl)-amide | CHEMBL2373044
Type:
Small organic molecule
Emp. Form.:
C23H36N6O5
Mol. Mass.:
476.5691
SMILES:
[#6]-[#6](-[#6])-[#6]-[#6@H](-[#7]-[#6](=O)-[#6@H](-[#6]-c1ccc(-[#8])cc1)-[#7]-[#6](-[#6])=O)-[#6](=O)-[#7]-[#6@@H](-[#6]-[#6]-[#6]\[#7]=[#6](\[#7])-[#7])-[#6]=O
: