Target
Cytochrome P450 2D6
Ligand
BDBM50013515
Substrate
Meas. Tech.
ChEMBL_123020 (CHEMBL729205)
Ki
190±n/a nM
Citation
 Strobl, GRvon Kruedener, SStöckigt, JGuengerich, FPWolff, T Development of a pharmacophore for inhibition of human liver cytochrome P-450 2D6: molecular modeling and inhibition studies. J Med Chem 36:1136-45 (1993)  
Target
Name:
Cytochrome P450 2D6
Synonyms:
CP2D6_HUMAN CYP2DL1 Cytochrome P450 2D6 (CYP2D6) P450-DB1
Type:
Protein
Mol. Mass.:
55774.82
Organism:
Homo sapiens (Human)
Description:
P10635
Residue:
497
  
Inhibitor
Name:
BDBM50013515
Synonyms:
(+)-yohimbine 17alpha-hydroxyyohimban-16alpha-carboxylic acid methyl ester CORYNANTHINE Quebrachin YOHIMBINE CHLORIDE Yohimbine cid_8969 methyl 17alpha-hydroxyyohimban-16alpha-carboxylate yohimbic acid methyl ester
Type:
Small organic molecule
Emp. Form.:
C21H26N2O3
Mol. Mass.:
354.4427
SMILES:
COC(=O)[C@H]1[C@@H](O)CC[C@H]2CN3CCc4c([nH]c5ccccc45)[C@@H]3C[C@H]12
: