Target
Cytochrome P450 2D6
Ligand
BDBM50407158
Substrate
Meas. Tech.
ChEMBL_123021 (CHEMBL729206)
Ki
520±n/a nM
Citation
 Strobl, GRvon Kruedener, SStöckigt, JGuengerich, FPWolff, T Development of a pharmacophore for inhibition of human liver cytochrome P-450 2D6: molecular modeling and inhibition studies. J Med Chem 36:1136-45 (1993)  
Target
Name:
Cytochrome P450 2D6
Synonyms:
CP2D6_HUMAN CYP2DL1 Cytochrome P450 2D6 (CYP2D6) P450-DB1
Type:
Protein
Mol. Mass.:
55774.82
Organism:
Homo sapiens (Human)
Description:
P10635
Residue:
497
  
Inhibitor
Name:
BDBM50407158
Synonyms:
CHEMBL2079613
Type:
Small organic molecule
Emp. Form.:
C19H21ClN2O
Mol. Mass.:
328.836
SMILES:
O[C@H]([C@H]1CC2CCN1CC2C=C)c1ccnc2ccc(Cl)cc12
: