Target
Amine oxidase [flavin-containing] B
Ligand
BDBM50029825
Substrate
Meas. Tech.
ChEMBL_100089 (CHEMBL709707)
IC50
2.2±n/a nM
Citation
 Mazouz, FGueddari, SBurstein, CMansuy, DMilcent, R 5-[4-(benzyloxy)phenyl]-1,3,4-oxadiazol-2(3H)-one derivatives and related analogues: new reversible, highly potent, and selective monamine oxidase type B inhibitors. J Med Chem 36:1157-67 (1993)  
Target
Name:
Amine oxidase [flavin-containing] B
Synonyms:
AOFB_RAT Amine oxidase [flavin-containing] B Monoamine Oxidase Type B (MAO-B) Monoamine oxidase B (MAO-B) Monoamine oxidase type B (MAOB) | Monoamine oxidase-B (MAO-B)
Type:
Enzyme
Mol. Mass.:
58469.65
Organism:
Rattus norvegicus (rat)
Description:
P19643
Residue:
520
  
Inhibitor
Name:
BDBM50029825
Synonyms:
3-[5-(4-Benzyloxy-phenyl)-2-oxo-[1,3,4]oxadiazol-3-yl]-propionitrile | CHEMBL17092
Type:
Small organic molecule
Emp. Form.:
C18H15N3O3
Mol. Mass.:
321.33
SMILES:
O=c1oc(nn1CCC#N)-c1ccc(OCc2ccccc2)cc1
: