Target
Adenosine deaminase
Ligand
BDBM50043791
Substrate
Meas. Tech.
ChEMBL_30798 (CHEMBL645074)
Ki
100000±n/a nM
Citation
 Cristalli, GEleuteri, AVolpini, RVittori, SCamaioni, ELupidi, G Adenosine deaminase inhibitors: synthesis and structure-activity relationships of 2-hydroxy-3-nonyl derivatives of azoles. J Med Chem 37:201-5 (1994)  
Target
Name:
Adenosine deaminase
Synonyms:
ADA Adenosine aminohydrolase
Type:
Enzyme
Mol. Mass.:
40910.44
Organism:
Bos taurus (bovine)
Description:
Residue:
363
  
Inhibitor
Name:
BDBM50043791
Synonyms:
3-[1,2,3]Triazol-1-yl-nonan-2-ol | CHEMBL64502
Type:
Small organic molecule
Emp. Form.:
C11H21N3O
Mol. Mass.:
211.3039
SMILES:
CCCCCCC(C(C)O)n1ccnn1
: