Target
5-hydroxytryptamine receptor 1A
Ligand
BDBM50035508
Substrate
Meas. Tech.
ChEMBL_1301 (CHEMBL616678)
Kd
0.30±n/a nM
Citation
 Zhuang, ZPKung, MPKung, HF Synthesis and evaluation of 4-(2'-methoxyphenyl)-1-[2'-[N-(2"-pyridinyl)-p- iodobenzamido]ethyl]piperazine (p-MPPI): a new iodinated 5-HT1A ligand. J Med Chem 37:1406-7 (1994)  
Target
Name:
5-hydroxytryptamine receptor 1A
Synonyms:
5-HT-1A 5-HT1A 5-hydroxytryptamine receptor 1A (5HT1A) 5ht1a Htr1a Serotonin 1a (5-HT1a) receptor/Adrenergic receptor alpha-1 | Serotonin receptor 1A
Type:
G Protein-Coupled Receptor (GPCR)
Mol. Mass.:
46445.29
Organism:
Rattus norvegicus (rat)
Description:
Binding assays were performed using rat hippocampal membranes.
Residue:
422
  
Inhibitor
Name:
BDBM50035508
Synonyms:
4-Iodo-N-{2-[4-(2-methoxy-phenyl)-piperazin-1-yl]-ethyl}-N-pyridin-2-yl-benzamide p-MPPI
Type:
Small organic molecule
Emp. Form.:
C25H27IN4O2
Mol. Mass.:
542.4119
SMILES:
COc1ccccc1N1CCN(CCN(C(=O)c2ccc(I)cc2)c2ccccn2)CC1
: