Target
Neuromedin-K receptor
Ligand
BDBM50030166
Substrate
Meas. Tech.
ChEMBL_143201 (CHEMBL747339)
IC50
170±n/a nM
Citation
 Josien, HLavielle, SBrunissen, ASaffroy, MTorrens, YBeaujouan, JCGlowinski, JChassaing, G Design and synthesis of side-chain conformationally restricted phenylalanines and their use for structure-activity studies on tachykinin NK-1 receptor. J Med Chem 37:1586-601 (1994)  
Target
Name:
Neuromedin-K receptor
Synonyms:
NK3R_RAT Tac3r | Tacr3
Type:
Mol. Mass.:
51128.60
Organism:
Rattus norvegicus
Description:
ChEMBL_10983
Residue:
452
  
Inhibitor
Name:
BDBM50030166
Synonyms:
Arg-Pro-Lys-Pro-Gln-Gln-Phe-Pen(S-Me)-Gly-Leu-Met | CHEMBL405422
Type:
Small organic molecule
Emp. Form.:
C60H100N18O13S2
Mol. Mass.:
1345.679
SMILES:
CSCC[C@H](NC(=O)[C@H](CC(C)C)NC(=O)CNC(=O)[C@@H](NC(=O)[C@H](Cc1ccccc1)NC(=O)[C@H](CCC(N)=O)NC(=O)[C@H](CCC(N)=O)NC(=O)[C@H]1CCCN1C(=O)[C@H](CCCCN)NC(=O)[C@@H]1CCCN1C(=O)[C@@H](N)CCCNC(N)=N)C(C)(C)SC)C(N)=O
: