Target
D(2) dopamine receptor
Ligand
BDBM50036850
Substrate
Meas. Tech.
ChEMBL_59314 (CHEMBL670208)
IC50
8±n/a nM
Citation
 Podona, TGuardiola-Lemaître, BCaignard, DHAdam, GPfeiffer, BRenard, PGuillaumet, G 3,4-Dihydro-3-amino-2H-1-benzopyran derivatives as 5-HT1A receptor ligands and potential anxiolytic agents. 1. Synthesis and structure--activity relationship studies. J Med Chem 37:1779-93 (1994)  
Target
Name:
D(2) dopamine receptor
Synonyms:
DOPAMINE D2 DRD2_BOVIN | Dopamine D2 receptor
Type:
Enzyme Catalytic Domain
Mol. Mass.:
50698.79
Organism:
BOVINE
Description:
P20288
Residue:
444
  
Inhibitor
Name:
BDBM50036850
Synonyms:
8-{4-[(5-Hydroxy-chroman-3-yl)-propyl-amino]-butyl}-8-aza-spiro[4.5]decane-7,9-dione | CHEMBL27763
Type:
Small organic molecule
Emp. Form.:
C25H36N2O4
Mol. Mass.:
428.5643
SMILES:
CCCN(CCCCN1C(=O)CC2(CCCC2)CC1=O)C1COc2cccc(O)c2C1
: