Target
5-hydroxytryptamine receptor 1B
Ligand
BDBM50036874
Substrate
Meas. Tech.
ChEMBL_1769 (CHEMBL616553)
IC50
3000±n/a nM
Citation
 Podona, TGuardiola-Lemaître, BCaignard, DHAdam, GPfeiffer, BRenard, PGuillaumet, G 3,4-Dihydro-3-amino-2H-1-benzopyran derivatives as 5-HT1A receptor ligands and potential anxiolytic agents. 1. Synthesis and structure--activity relationship studies. J Med Chem 37:1779-93 (1994)  
Target
Name:
5-hydroxytryptamine receptor 1B
Synonyms:
5-HT-1B 5-hydroxytryptamine receptor 1B (5HT1B) 5ht1b Serotonin 1 (5-HT1) receptor Serotonin receptor 1B
Type:
Protein
Mol. Mass.:
43173.33
Organism:
Rattus norvegicus (Rat)
Description:
P28564
Residue:
386
  
Inhibitor
Name:
BDBM50036874
Synonyms:
4-Fluoro-N-{4-[(5-methoxy-chroman-3-yl)-propyl-amino]-butyl}-benzamide; compound with oxalic acid | CHEMBL298534
Type:
Small organic molecule
Emp. Form.:
C24H31FN2O3
Mol. Mass.:
414.5129
SMILES:
CCCN(CCCCNC(=O)c1ccc(F)cc1)C1COc2cccc(OC)c2C1
: