Target
Alpha-1A adrenergic receptor
Ligand
BDBM50036867
Substrate
Meas. Tech.
ChEMBL_32974 (CHEMBL644689)
IC50
1000000±n/a nM
Citation
 Podona, TGuardiola-Lemaître, BCaignard, DHAdam, GPfeiffer, BRenard, PGuillaumet, G 3,4-Dihydro-3-amino-2H-1-benzopyran derivatives as 5-HT1A receptor ligands and potential anxiolytic agents. 1. Synthesis and structure--activity relationship studies. J Med Chem 37:1779-93 (1994)  
Target
Name:
Alpha-1A adrenergic receptor
Synonyms:
ADA1A_BOVIN ADRA1C Alpha 1A-adrenoreceptor Cerebral cortex alpha adrenergic receptor | adrenergic Alpha1
Type:
Enzyme Catalytic Domain
Mol. Mass.:
51492.08
Organism:
CALF
Description:
adrenergic Alpha1 0 CALF
Residue:
466
  
Inhibitor
Name:
BDBM50036867
Synonyms:
2-[4-(5-Methoxy-chroman-3-ylamino)-butyl]-isoindole-1,3-dione; compound with oxalic acid | CHEMBL296395
Type:
Small organic molecule
Emp. Form.:
C22H24N2O4
Mol. Mass.:
380.437
SMILES:
COc1cccc2OCC(Cc12)NCCCCN1C(=O)c2ccccc2C1=O
: