Target
Lactoylglutathione lyase
Ligand
BDBM50039111
Substrate
Meas. Tech.
ChEMBL_71294 (CHEMBL684998)
Ki
1200±n/a nM
Citation
 Murthy, NSBakeris, TKavarana, MJHamilton, DSLan, YCreighton, DJ S-(N-aryl-N-hydroxycarbamoyl)glutathione derivatives are tight-binding inhibitors of glyoxalase I and slow substrates for glyoxalase II. J Med Chem 37:2161-6 (1994)  
Target
Name:
Lactoylglutathione lyase
Synonyms:
Aldoketomutase Glx I Glyoxalase I LGUL_HUMAN S-D-lactoylglutathione methylglyoxal lyase
Type:
Enzyme
Mol. Mass.:
20772.95
Organism:
Homo sapiens (Human)
Description:
Q04760
Residue:
184
  
Inhibitor
Name:
BDBM50039111
Synonyms:
S-(N-Hydroxy-N-(4-bromophenyl)carbamoyl)glutathione
Type:
Small organic molecule
Emp. Form.:
C17H20BrN4O8S
Mol. Mass.:
520.332
SMILES:
[NH3+]C(CCC(=O)NC(CSC(=O)N(O)c1ccc(Br)cc1)C(=O)NCC([O-])=O)C([O-])=O
: